{"text_format":"1","workbook":"xlsx","n_sheets":4,"sheets":["Data Sheet","Enter Sheet","Instructions","Ref sheet"],"not_rendered":{"charts":0,"images":4,"macros":1,"external_links":0,"defined_names":8,"comments":0,"pivot_tables":0},"unopened":[],"bounds":{"document_bytes":16777216,"sheet_cells":100000,"rows_first":2000,"rows_last":500,"rows_between":2000,"halvings":0,"cell_chars":16384,"cell_head_chars":4096},"cells_cut":0,"cells_raw":0,"read":"whole","date_system":"1900"}

{"sheet":"Data Sheet","index":0,"n_rows":110,"n_cols":36,"rows_kept":110,"cut":false,"hidden":true,"merged":[[0,0,0,35],[2,2,2,3],[2,7,2,8],[3,2,3,3],[3,7,3,8]]}
["Enable New Zealand MOH Under $2,000 Job card record"]
[]
[null,"Company Name",{"$f":"IF(Company_Name=\"\",\"\",Company_Name)","v":""},null,null,null,"Invoice date",{"$f":"IF(Invoice_date=\"\",\"\",Invoice_date)","v":""}]
[null,"ENZ Reference Num",{"$f":"IF(ENZ_Reference_Num=\"\",\"\",ENZ_Reference_Num)","v":""},null,null,null,"Invoice Number",{"$f":"IF(Invoice_Number=\"\",\"\",Invoice_Number)","v":""}]
[null,null,"Start Date","End Date",null,null,"Total Value (excl GST)",{"$f":"+SUM(AA9:AA108)","v":0},null,{"$f":"IF(COUNTBLANK(AJ9:AJ108)=100, \"\", \"Check Column Y - line item over $1k.\")","v":""}]
[null,"Job card period",{"$f":"IF(Job_card_period=\"\",\"\",Job_card_period)","v":""},{"$f":"IF('Enter Sheet'!C6=\"\",\"\",'Enter Sheet'!C6)","v":""}]
[]
["Job Ref","Charge type","Clients First Name","Clients Surname","Clients Address Street No","Clients Address Street ","Clients Address Town/City","Clients Phone Number","Date repair/service requested","Date  repair/service completed","Asset Number","Asset Description","Manufacturers Serial No.","Test and Tag","Beyond Economic Repair (BER)","BER Comment","Repair Description","Labour Hours","Travel Hours","Travel Distance (km)","Parts Description","Parts Costs","Labour Hours Total ","Travel Hours Total","Travel KM Total ","Service Cost (Test and Tag)","TOTAL JOB COST","Company Name","ENZ Reference Num","Invoice date","Invoice Number","Cost  per unit (LH)","Cost  per unit (TH)","Cost  per unit (TD)","Cost per Unit (TT)","Total check"]
[{"$f":"IF(Table1[[#This Row],[Job Ref]]=\"\",\"\",Table1[[#This Row],[Job Ref]])","v":""},{"$f":"IF(Table1[[#This Row],[Job Ref]]=\"\",\"\",VLOOKUP(Table1[[#This Row],[Charge type]],Table3[],2,FALSE))","v":""},{"$f":"IF(Table1[[#This Row],[Job Ref]]=\"\",\"\",Table1[[#This Row],[Clients First Name]])","v":""},{"$f":"IF(Table1[[#This Row],[Job Ref]]=\"\",\"\",Table1[[#This Row],[Clients Surname]])","v":""},{"$f":"IF(Table1[[#This Row],[Job Ref]]=\"\",\"\",Table1[[#This Row],[Clients Address Street No]])","v":""},{"$f":"IF(Table1[[#This Row],[Job Ref]]=\"\",\"\",Table1[[#This Row],[Clients Address Street ]])","v":""},{"$f":"IF(Table1[[#This Row],[Job Ref]]=\"\",\"\",Table1[[#This Row],[Clients Address Town/City]])","v":""},{"$f":"IF(Table1[[#This Row],[Job Ref]]=\"\",\"\",Table1[[#This Row],[Clients Phone Number]])","v":""},{"$f":"IF(Table1[[#This Row],[Job Ref]]=\"\",\"\",Table1[[#This Row],[Date repair/service requested]])","v":""},{"$f":"IF(Table1[[#This Row],[Job Ref]]=\"\",\"\",Table1[[#This Row],[Date  repair/service completed]])","v":""},{"$f":"IF(Table1[[#This Row],[Job Ref]]=\"\",\"\",Table1[[#This Row],[Asset Number]])","v":""},{"$f":"IF(Table1[[#This Row],[Job Ref]]=\"\",\"\",Table1[[#This Row],[Asset Description]])","v":""},{"$f":"IF(Table1[[#This Row],[Job Ref]]=\"\",\"\",Table1[[#This Row],[Manufacturers Serial No.]])","v":""},{"$f":"IF(Table1[[#This Row],[Job Ref]]=\"\",\"\",Table1[[#This Row],[Test and Tag]])","v":""},{"$f":"IF(Table1[[#This Row],[Job Ref]]=\"\",\"\",Table1[[#This Row],[Beyond Economic Repair (BER)]])","v":""},{"$f":"IF(Table1[[#This Row],[Job Ref]]=\"\",\"\",Table1[[#This Row],[BER Comment]])","v":""},{"$f":"IF(Table1[[#This Row],[Job Ref]]=\"\",\"\",Table1[[#This Row],[Repair Description]])","v":""},{"$f":"IF(Table1[[#This Row],[Job Ref]]=\"\",\"\",Table1[[#This Row],[Labour Hours]])","v":""},{"$f":"IF(Table1[[#This Row],[Job Ref]]=\"\",\"\",Table1[[#This Row],[Travel Hours]])","v":""},{"$f":"IF(Table1[[#This Row],[Job Ref]]=\"\",\"\",Table1[[#This Row],[Travel Distance (km)]])","v":""},{"$f":"IF(Table1[[#This Row],[Job Ref]]=\"\",\"\",Table1[[#This Row],[Parts Description]])","v":""},{"$f":"IF(Table1[[#This Row],[Job Ref]]=\"\",\"\",Table1[[#This Row],[Parts Costs]])","v":""},{"$f":"IFERROR(Table13[[#This Row],[Labour Hours]]*Table13[[#This Row],[Cost  per unit (LH)]],0)","v":0},{"$f":"IFERROR(Table13[[#This Row],[Travel Hours]]*Table13[[#This Row],[Cost  per unit (TH)]],0)","v":0},{"$f":"IFERROR(Table13[[#This Row],[Travel Distance (km)]]*Table13[[#This Row],[Cost  per unit (TD)]],0)","v":0},{"$f":"IF(Table13[[#This Row],[Test and Tag]]=\"Yes\",Table13[[#This Row],[Cost per Unit (TT)]],0)","v":0},{"$f":"SUM(Table13[[#This Row],[Parts Costs]],Table13[[#This Row],[Travel KM Total ]],Table13[[#This Row],[Labour Hours Total ]],Table13[[#This Row],[Service Cost (Test and Tag)]],Table13[[#This Row],[Travel Hours Total]])","v":0},{"$f":"IF(Table13[[#This Row],[Charge type]]<>\"\",Company_Name,\"\")","v":""},{"$f":"IF(Table13[[#This Row],[Charge type]]<>\"\",ENZ_Reference_Num,\"\")","v":""},{"$f":"IF(Table13[[#This Row],[Charge type]]<>\"\",Invoice_date,\"\")","v":""},{"$f":"IF(Table13[[#This Row],[Charge type]]<>\"\",Invoice_Number,\"\")","v":""},85,85,0.64,15,{"$f":"IF(Table13[[#This Row],[TOTAL JOB COST]]>1999.99,\"OVER $2k - contact Enable\",\"\")","v":""}]
[{"$f":"IF(Table1[[#This Row],[Job Ref]]=\"\",\"\",Table1[[#This Row],[Job Ref]])","v":""},{"$f":"IF(Table1[[#This Row],[Job Ref]]=\"\",\"\",VLOOKUP(Table1[[#This Row],[Charge type]],Table3[],2,FALSE))","v":""},{"$f":"IF(Table1[[#This Row],[Job Ref]]=\"\",\"\",Table1[[#This Row],[Clients First Name]])","v":""},{"$f":"IF(Table1[[#This Row],[Job Ref]]=\"\",\"\",Table1[[#This Row],[Clients Surname]])","v":""},{"$f":"IF(Table1[[#This Row],[Job Ref]]=\"\",\"\",Table1[[#This Row],[Clients Address Street No]])","v":""},{"$f":"IF(Table1[[#This Row],[Job Ref]]=\"\",\"\",Table1[[#This Row],[Clients Address Street ]])","v":""},{"$f":"IF(Table1[[#This Row],[Job Ref]]=\"\",\"\",Table1[[#This Row],[Clients Address Town/City]])","v":""},{"$f":"IF(Table1[[#This Row],[Job Ref]]=\"\",\"\",Table1[[#This Row],[Clients Phone Number]])","v":""},{"$f":"IF(Table1[[#This Row],[Job Ref]]=\"\",\"\",Table1[[#This Row],[Date repair/service requested]])","v":""},{"$f":"IF(Table1[[#This Row],[Job Ref]]=\"\",\"\",Table1[[#This Row],[Date  repair/service completed]])","v":""},{"$f":"IF(Table1[[#This Row],[Job Ref]]=\"\",\"\",Table1[[#This Row],[Asset Number]])","v":""},{"$f":"IF(Table1[[#This Row],[Job Ref]]=\"\",\"\",Table1[[#This Row],[Asset Description]])","v":""},{"$f":"IF(Table1[[#This Row],[Job Ref]]=\"\",\"\",Table1[[#This Row],[Manufacturers Serial No.]])","v":""},{"$f":"IF(Table1[[#This Row],[Job Ref]]=\"\",\"\",Table1[[#This Row],[Test and Tag]])","v":""},{"$f":"IF(Table1[[#This Row],[Job Ref]]=\"\",\"\",Table1[[#This Row],[Beyond Economic Repair (BER)]])","v":""},{"$f":"IF(Table1[[#This Row],[Job Ref]]=\"\",\"\",Table1[[#This Row],[BER Comment]])","v":""},{"$f":"IF(Table1[[#This Row],[Job Ref]]=\"\",\"\",Table1[[#This Row],[Repair Description]])","v":""},{"$f":"IF(Table1[[#This Row],[Job Ref]]=\"\",\"\",Table1[[#This Row],[Labour Hours]])","v":""},{"$f":"IF(Table1[[#This Row],[Job Ref]]=\"\",\"\",Table1[[#This Row],[Travel Hours]])","v":""},{"$f":"IF(Table1[[#This Row],[Job Ref]]=\"\",\"\",Table1[[#This Row],[Travel Distance (km)]])","v":""},{"$f":"IF(Table1[[#This Row],[Job Ref]]=\"\",\"\",Table1[[#This Row],[Parts Description]])","v":""},{"$f":"IF(Table1[[#This Row],[Job Ref]]=\"\",\"\",Table1[[#This Row],[Parts Costs]])","v":""},{"$f":"IFERROR(Table13[[#This Row],[Labour Hours]]*Table13[[#This Row],[Cost  per unit (LH)]],0)","v":0},{"$f":"IFERROR(Table13[[#This Row],[Travel Hours]]*Table13[[#This Row],[Cost  per unit (TH)]],0)","v":0},{"$f":"IFERROR(Table13[[#This Row],[Travel Distance (km)]]*Table13[[#This Row],[Cost  per unit (TD)]],0)","v":0},{"$f":"IF(Table13[[#This Row],[Test and Tag]]=\"Yes\",Table13[[#This Row],[Cost per Unit (TT)]],0)","v":0},{"$f":"SUM(Table13[[#This Row],[Parts Costs]],Table13[[#This Row],[Travel KM Total ]],Table13[[#This Row],[Labour Hours Total ]],Table13[[#This Row],[Service Cost (Test and Tag)]],Table13[[#This Row],[Travel Hours Total]])","v":0},{"$f":"IF(Table13[[#This Row],[Charge type]]<>\"\",Company_Name,\"\")","v":""},{"$f":"IF(Table13[[#This Row],[Charge type]]<>\"\",ENZ_Reference_Num,\"\")","v":""},{"$f":"IF(Table13[[#This Row],[Charge type]]<>\"\",Invoice_date,\"\")","v":""},{"$f":"IF(Table13[[#This Row],[Charge type]]<>\"\",Invoice_Number,\"\")","v":""},85,85,0.64,15,{"$f":"IF(Table13[[#This Row],[TOTAL JOB COST]]>1999.99,\"OVER $2k - contact Enable\",\"\")","v":""}]
{"$rows_left_out":101}
{"sheet":"Enter Sheet","index":1,"n_rows":110,"n_cols":39,"rows_kept":110,"cut":false,"hidden":false,"merged":[[0,1,1,3],[2,1,2,2],[3,1,3,2],[2,5,2,6],[5,5,5,6],[3,5,3,6]]}
[null,"DSS Bulk Job Sheet",null,null,null,"Email job Sheet & invoice to: mohrepairs@enable.co.nz"]
[]
["COMPANY NAME",null,null,null,"INVOICE DATE"]
["VENDOR ID",null,null,null,"INVOICE NUMBER"]
[null,"START DATE","END DATE",null,"TOTAL EX GST",{"$f":"+SUM(AA9:AA108)","v":0},null,null,null,{"$f":"IF(COUNTBLANK(AJ9:AJ108)=100, \"\", \"Check Column Y - line item over $1k.\")","v":""}]
["JOB CARD PERIOD",null,null,null,"GST NUMBER"]
[{"$f":"IF(COUNTIF(Table1[Error],\"*equipment*\"),\"Please check error column at the end of the table\",\"\")","v":""}]
["Job Ref","Charge type","Clients First Name","Clients Surname","Clients Address Street No","Clients Address Street ","Clients Address Town/City","Clients Phone Number","Date repair/service requested","Date  repair/service completed","Asset Number","Asset Description","Manufacturers Serial No.","Test and Tag","Beyond Economic Repair (BER)","BER Comment","Repair Description","Labour Hours","Travel Hours","Travel Distance (km)","Parts Description","Parts Costs","Labour Hours Total ","Travel Hours Total","Travel KM Total ","Service Cost (Test and Tag)","TOTAL JOB COST","Company Name","ENZ Reference Num","Invoice date","Invoice Number","Cost  per unit (LH)","Cost  per unit (TH)","Cost  per unit (TD)","Cost per Unit (TT)","Total check","Equipment Type","Limit","Error"]
[null,null,null,null,null,null,null,null,null,null,null,null,null,null,null,null,null,null,null,null,null,null,{"$f":"IFERROR(Table1[[#This Row],[Labour Hours]]*Table1[[#This Row],[Cost  per unit (LH)]],0)","v":0},{"$f":"IFERROR(Table1[[#This Row],[Travel Hours]]*Table1[[#This Row],[Cost  per unit (TH)]],0)","v":0},{"$f":"IFERROR(Table1[[#This Row],[Travel Distance (km)]]*Table1[[#This Row],[Cost  per unit (TD)]],0)","v":0},{"$f":"IF(Table1[[#This Row],[Test and Tag]]=\"Yes\",Table1[[#This Row],[Cost per Unit (TT)]],0)","v":0},{"$f":"SUM(Table1[[#This Row],[Parts Costs]],Table1[[#This Row],[Travel KM Total ]],Table1[[#This Row],[Labour Hours Total ]],Table1[[#This Row],[Service Cost (Test and Tag)]],Table1[[#This Row],[Travel Hours Total]])","v":0},{"$f":"IF(Table1[[#This Row],[Charge type]]<>\"\",Company_Name,\"\")","v":""},{"$f":"IF(Table1[[#This Row],[Charge type]]<>\"\",ENZ_Reference_Num,\"\")","v":""},{"$f":"IF(Table1[[#This Row],[Charge type]]<>\"\",Invoice_date,\"\")","v":""},{"$f":"IF(Table1[[#This Row],[Charge type]]<>\"\",Invoice_Number,\"\")","v":""},{"$f":"85","v":85},{"$f":"85","v":85},{"$f":"0.64","v":0.64},{"$f":"15","v":15},{"$f":"IF(Table1[[#This Row],[TOTAL JOB COST]]>1999.99,\"OVER $2k - contact Enable\",\"\")","v":""},null,{"$f":"IFERROR(VLOOKUP(Table1[[#This Row],[Equipment Type]],'Ref sheet'!I$2:J$7,2,FALSE),\"\")","v":""},{"$f":"IF(AND(Table1[[#This Row],[Equipment Type]]= \"\", Table1[[#This Row],[TOTAL JOB COST]] <> 0), \"Please set equipment type\", IF(Table1[[#This Row],[Limit]]<Table1[[#This Row],[TOTAL JOB COST]],\"Over equipment type limit\",\"\"))","v":""}]
[null,null,null,null,null,null,null,null,null,null,null,null,null,null,null,null,null,null,null,null,null,null,{"$f":"IFERROR(Table1[[#This Row],[Labour Hours]]*Table1[[#This Row],[Cost  per unit (LH)]],0)","v":0},{"$f":"IFERROR(Table1[[#This Row],[Travel Hours]]*Table1[[#This Row],[Cost  per unit (TH)]],0)","v":0},{"$f":"IFERROR(Table1[[#This Row],[Travel Distance (km)]]*Table1[[#This Row],[Cost  per unit (TD)]],0)","v":0},{"$f":"IF(Table1[[#This Row],[Test and Tag]]=\"Yes\",Table1[[#This Row],[Cost per Unit (TT)]],0)","v":0},{"$f":"SUM(Table1[[#This Row],[Parts Costs]],Table1[[#This Row],[Travel KM Total ]],Table1[[#This Row],[Labour Hours Total ]],Table1[[#This Row],[Service Cost (Test and Tag)]],Table1[[#This Row],[Travel Hours Total]])","v":0},{"$f":"IF(Table1[[#This Row],[Charge type]]<>\"\",Company_Name,\"\")","v":""},{"$f":"IF(Table1[[#This Row],[Charge type]]<>\"\",ENZ_Reference_Num,\"\")","v":""},{"$f":"IF(Table1[[#This Row],[Charge type]]<>\"\",Invoice_date,\"\")","v":""},{"$f":"IF(Table1[[#This Row],[Charge type]]<>\"\",Invoice_Number,\"\")","v":""},{"$f":"85","v":85},{"$f":"85","v":85},0.64,{"$f":"15","v":15},{"$f":"IF(Table1[[#This Row],[TOTAL JOB COST]]>1999.99,\"OVER $2k - contact Enable\",\"\")","v":""},null,{"$f":"IFERROR(VLOOKUP(Table1[[#This Row],[Equipment Type]],'Ref sheet'!I$2:J$7,2,FALSE),\"\")","v":""},{"$f":"IF(AND(Table1[[#This Row],[Equipment Type]]= \"\", Table1[[#This Row],[TOTAL JOB COST]] <> 0), \"Please set equipment type\", IF(Table1[[#This Row],[Limit]]<Table1[[#This Row],[TOTAL JOB COST]],\"Over equipment type limit\",\"\"))","v":""}]
{"$rows_left_out":101}
{"sheet":"Instructions","index":2,"n_rows":62,"n_cols":2,"rows_kept":62,"cut":false,"hidden":false,"merged":[]}
["INSTRUCTIONS:"]
["You can only enter a limited number of repairs/services per jobcard/file. Once full, create your invoice and send to Enable. "]
["It is recommended you send these weekly even if not full, and at end of month."]
["Need to send in as a excel workbook - ie email this file - with your invoice attached"]
["Email invoice and job card to acc.subcontractor@enable.co.nz "]
[]
[]
["Field ","Description"]
["Company Name","Your company name"]
["Job card period ","Start date of job card to end date  (could be a week/two weeks or month)"]
{"$rows_left_out":53}
{"sheet":"Ref sheet","index":3,"n_rows":44,"n_cols":25,"rows_kept":44,"cut":false,"hidden":true,"merged":[]}
[null,"Charge Type","Charge Old","Charge New",null,"BER","Yes",null,"Charge limits"]
[null,null,"AS - Annual Service","AS - MOH Annual Serv",null,null,"No",null,"Powered Wheelchairs",2000]
[null,null,"FR - Freight","FR - MOH Freight",null,null,null,null,"Manual Wheelchairs",1600]
[null,null,"MD - Modification","MD - MOH Mods",null,null,null,null,"Hoists",800]
[null,null,"RF - Refurbishment","RF - MOH Refurb",null,null,null,null,"Beds",900]
[null,null,"RP - Repair","RP - MOH Repair",null,null,null,null,"Complex Bath/Toilets",2000]
[null,null,"SA - Setup/Adjust","SA - MOH Setup/Adj",null,null,null,null,"Other",1000]
[null,null,"DL - Deliver","CL - MOH Collect/Del"]
[null,null,"CL - Collect","CL - MOH Collect/Del"]
[]
{"$rows_left_out":34}